Reaction Details
TargetLysine-specific demethylase 4C
LigandBDBM60875
Substrate/Competitorn/a
Meas. Tech.Demethylase AlphaScreen Assay
pH7.5±n/a
IC50 6.49e+4±n/a nM
Commentsextracted
Citation Johansson, CVelupillai, STumber, ASzykowska, AHookway, ESNowak, RPStrain-Damerell, CGileadi, CPhilpott, MBurgess-Brown, NWu, NKopec, JNuzzi, ASteuber, HEgner, UBadock, VMunro, SLaThangue, NBWestaway, SBrown, JAthanasou, NPrinjha, RBrennan, PEOppermann, U Structural analysis of human KDM5B guides histone demethylase inhibitor development. Nat Chem Biol12:539-45 (2016) 
 
Lysine-specific demethylase 4C
Name:Lysine-specific demethylase 4C
Type:Protein
Mol. Mass.:119979.01
Organism:Homo sapiens (Human)
Description:Q9H3R0
Residue:1056
BDBM60875
NameBDBM60875
Synonyms:3-((6-(4,5-Dihydro-1H-benzo[d]azepin-3(2H)-yl)-2-(pyridin-2-yl)pyrimidin-4-yl)amino)propanoic acid GSK J1 GSKJ1
Typen/a
Emp. Form.C22H23N5O2
Mol. Mass.389.4503
SMILESOC(=O)CCNc1cc(nc(n1)-c1ccccn1)N1CCc2ccccc2CC1