Reaction Details
TargetTyrosine-protein kinase JAK3
LigandBDBM209866
Substrate/Competitorn/a
Meas. Tech.JAK Enzyme Assay
pH7.4±n/a
Temperature298.15±n/a K
IC50 33.1±3.1 nM
Commentsextracted
Citation Telliez, JBDowty, MEWang, LJussif, JLin, TLi, LMoy, EBalbo, PLi, WZhao, YCrouse, KDickinson, CSymanowicz, PHegen, MBanker, MEVincent, FUnwalla, RLiang, SGilbert, AMBrown, MFHayward, MMontgomery, JYang, XBauman, JTrujillo, JICasimiro-Garcia, AVajdos, FFLeung, LGeoghegan, KFQuazi, AXuan, DJones, LHett, EWright, KClark, JDThorarensen, A Discovery of a JAK3-Selective Inhibitor: Functional Differentiation of JAK3-Selective Inhibition over pan-JAK or JAK1-Selective Inhibition. ACS Chem Biol11:3442-3451 (2016) 
 
Tyrosine-protein kinase JAK3
Name:Tyrosine-protein kinase JAK3
Type:Protein
Mol. Mass.:125111.08
Organism:Homo sapiens (Human)
Description:P52333
Residue:1124
BDBM209866
NameBDBM209866
Synonyms:PF-06651600 US20230348487, Example PF-06651600 | US9617258, Example 5
TypeSmall organic molecule
Emp. Form.C15H19N5O
Mol. Mass.285.3443
SMILESC[C@H]1CC[C@H](CN1C(=O)C=C)Nc1ncnc2[nH]ccc12