Reaction Details
TargetTyrosine-protein kinase JAK3
LigandBDBM50193995
Substrate/Competitorn/a
Meas. Tech.JAK Enzyme Assay
pH7.4±n/a
Temperature298.15±n/a K
IC50 45±7.5 nM
Commentsextracted
Citation Telliez, JBDowty, MEWang, LJussif, JLin, TLi, LMoy, EBalbo, PLi, WZhao, YCrouse, KDickinson, CSymanowicz, PHegen, MBanker, MEVincent, FUnwalla, RLiang, SGilbert, AMBrown, MFHayward, MMontgomery, JYang, XBauman, JTrujillo, JICasimiro-Garcia, AVajdos, FFLeung, LGeoghegan, KFQuazi, AXuan, DJones, LHett, EWright, KClark, JDThorarensen, A Discovery of a JAK3-Selective Inhibitor: Functional Differentiation of JAK3-Selective Inhibition over pan-JAK or JAK1-Selective Inhibition. ACS Chem Biol11:3442-3451 (2016) 
 
Tyrosine-protein kinase JAK3
Name:Tyrosine-protein kinase JAK3
Type:Protein
Mol. Mass.:125111.08
Organism:Homo sapiens (Human)
Description:P52333
Residue:1124
BDBM50193995
NameBDBM50193995
Synonyms:3-((3R,4R)-4-methyl-3-(methyl(7H-pyrrolo[2,3-d]pyrimidin-4-yl)amino)piperidin-1-yl)-3-oxopropanenitrile 3-{(3R,4R)-4-methyl-3-[methyl(7H-pyrrolo[2,3-d]pyrimidin-4-yl)amino]piperidin-1-yl}-3-oxopropanenitrile CP-690550 Tofacitinib US10112907, Example 00035 US10766894, Compound TABLE 1.20 US11078206, Example Tofacitinib US11339167, Example Tofacitinib
TypeSmall organic molecule
Emp. Form.C16H20N6O
Mol. Mass.312.3696
SMILESC[C@@H]1CCN(C[C@@H]1N(C)c1ncnc2[nH]ccc12)C(=O)CC#N