Reaction Details
TargetTyrosine-protein kinase ITK/TSK
LigandBDBM209866
Substrate/Competitorn/a
Meas. Tech.TR-FRET Competition Assay
pH7.5±n/a
Ki 0.0269±0.0 nM
Commentsextracted
Citation Telliez, JBDowty, MEWang, LJussif, JLin, TLi, LMoy, EBalbo, PLi, WZhao, YCrouse, KDickinson, CSymanowicz, PHegen, MBanker, MEVincent, FUnwalla, RLiang, SGilbert, AMBrown, MFHayward, MMontgomery, JYang, XBauman, JTrujillo, JICasimiro-Garcia, AVajdos, FFLeung, LGeoghegan, KFQuazi, AXuan, DJones, LHett, EWright, KClark, JDThorarensen, A Discovery of a JAK3-Selective Inhibitor: Functional Differentiation of JAK3-Selective Inhibition over pan-JAK or JAK1-Selective Inhibition. ACS Chem Biol11:3442-3451 (2016) 
 
Tyrosine-protein kinase ITK/TSK
Name:Tyrosine-protein kinase ITK/TSK
Type:Protein
Mol. Mass.:71839.20
Organism:Homo sapiens (Human)
Description:Q08881
Residue:620
BDBM209866
NameBDBM209866
Synonyms:PF-06651600 US20230348487, Example PF-06651600 | US9617258, Example 5
TypeSmall organic molecule
Emp. Form.C15H19N5O
Mol. Mass.285.3443
SMILESC[C@H]1CC[C@H](CN1C(=O)C=C)Nc1ncnc2[nH]ccc12