Reaction Details
TargetTyrosine-protein kinase SYK
LigandBDBM290819
Substrate/Competitorn/a
Meas. Tech.In Vitro Assay
pH7.5±n/a
Temperature298.15±n/a K
IC50<1±n/a nM
Commentsextracted
Citation Jia, ZJVenkataramani, CHuang, WMehrotra, MSong, YXu, QBauer, SMRose, JWKane, BPandey, A Inhibitors of syk and JAK protein kinases US Patent US9579320 Publication Date 2/28/2017
 
Tyrosine-protein kinase SYK
Name:Tyrosine-protein kinase SYK
Type:Enzyme
Mol. Mass.:72079.99
Organism:Homo sapiens (Human)
Description:P43405
Residue:635
BDBM290819
NameBDBM290819
Synonyms:(S)-4-(3-(2H-1,2,3-triazol-2-yl)phenylamino)-2-(1-amino-3-methoxypropan-2-ylamino)pyrimidine-5-carboxamide | US9579320, Example 219
TypeSmall organic molecule
Emp. Form.C17H21N9O2
Mol. Mass.383.4077
SMILESCOC[C@H](CN)Nc1ncc(C(N)=O)c(Nc2cccc(c2)-n2nccn2)n1