Reaction Details
TargetTyrosine-protein kinase SYK
LigandBDBM291001
Substrate/Competitorn/a
Meas. Tech.In Vitro Assay
pH7.5±n/a
Temperature298.15±n/a K
IC50 5.5±n/a nM
Commentsextracted
Citation Jia, ZJVenkataramani, CHuang, WMehrotra, MSong, YXu, QBauer, SMRose, JWKane, BPandey, A Inhibitors of syk and JAK protein kinases US Patent US9579320 Publication Date 2/28/2017
 
Tyrosine-protein kinase SYK
Name:Tyrosine-protein kinase SYK
Type:Enzyme
Mol. Mass.:72079.99
Organism:Homo sapiens (Human)
Description:P43405
Residue:635
BDBM291001
NameBDBM291001
Synonyms:(R)-2-(2-amino-3-methoxypropylamino)-4-(2,3-dihydro-1H-pyrrolo[1,2-a]indol-8-ylamino)pyrimidine-5-carboxamide | US9579320, Example 447
TypeSmall organic molecule
Emp. Form.C20H25N7O2
Mol. Mass.395.4582
SMILESCOC[C@H](N)CNc1ncc(C(N)=O)c(Nc2cccc3n4CCCc4cc23)n1