Reaction Details
TargetCOP9 signalosome complex subunit 5
LigandBDBM224012
Substrate/Competitorn/a
Meas. Tech.In Vitro Csn5 Activity Assay
pH7.5±0
IC50 3.0e+4±n/a nM
Citation Li, JYakushi, TParlati, FMackinnon, ALPerez, CMa, YCarter, KPColayco, SMagnuson, GBrown, BNguyen, KVasile, SSuyama, ESmith, LHSergienko, EPinkerton, ABChung, TDYPalmer, AEPass, IHess, SCohen, SMDeshaies, RJ Capzimin is a potent and specific inhibitor of proteasome isopeptidase Rpn11. Nat Chem Biol13:486-493 (2017) 
 
COP9 signalosome complex subunit 5
Name:COP9 signalosome complex subunit 5
Type:Protein
Mol. Mass.:37578.39
Organism:Homo sapiens (Human)
Description:Q92905
Residue:334
BDBM224012
NameBDBM224012
Synonyms:Capzimin | US10005735, Compound 12
TypeSmall organic molecule
Emp. Form.C15H13N3OS2
Mol. Mass.315.413
SMILESSc1cccc2cc(cnc12)C(=O)NCCc1nccs1