Reaction Details
TargetMetallo-beta-lactamase type 2
LigandBDBM360912
Substrate/Competitorn/a
IC50 0.020±n/a nM
Citation Bennett, FJiang, JPasternak, ADong, SGu, XScott, JDTang, HZhao, ZHuang, YYang, DYoung, KXiao, LZhang, ZFu, J Metallo-beta-lactamase inhibitors US Patent US10544130 Publication Date 1/28/2020
 
Metallo-beta-lactamase type 2
Name:Metallo-beta-lactamase type 2
Type:PROTEIN
Mol. Mass.:28498.15
Organism:Klebsiella pneumoniae
Description:ChEMBL_103887
Residue:270
BDBM360912
NameBDBM360912
Synonyms:(R)-tert-butyl 3-(2-(N,N-bis(4- methoxybenzyl)sulfamoyl)-4- iodo-3-(2-(4-methoxybenzyl)- 2H-tetrazol-5- yl)phenylsulfonamido)pyrrolidine- 1-carboxylate US10544130, Example 72
TypeSmall organic molecule
Emp. Form.C40H46IN7O9S2
Mol. Mass.959.869
SMILESCOc1ccc(CN(Cc2ccc(OC)cc2)S(=O)(=O)c2c(ccc(I)c2-c2nnn(Cc3ccc(OC)cc3)n2)S(=O)(=O)N[C@@H]2CCN(C2)C(=O)OC(C)(C)C)cc1