Reaction Details
TargetMetallo-beta-lactamase type 2
LigandBDBM360961
Substrate/Competitorn/a
IC50 0.013±n/a nM
Citation Bennett, FJiang, JPasternak, ADong, SGu, XScott, JDTang, HZhao, ZHuang, YYang, DYoung, KXiao, LZhang, ZFu, J Metallo-beta-lactamase inhibitors US Patent US10544130 Publication Date 1/28/2020
 
Metallo-beta-lactamase type 2
Name:Metallo-beta-lactamase type 2
Type:PROTEIN
Mol. Mass.:28498.15
Organism:Klebsiella pneumoniae
Description:ChEMBL_103887
Residue:270
BDBM360961
NameBDBM360961
Synonyms:2-(4-(2- aminobenzo[d] thiazol-4-yl)-2- sulfamoyl-3-(1H- tetrazol-5-yl)phenyl- sulfonamido)-2- methylpropan-1- aminium formate US10544130, Example 117
TypeSmall organic molecule
Emp. Form.C18H21N9O4S3
Mol. Mass.523.612
SMILESCC(C)(CN)NS(=O)(=O)c1ccc(-c2cccc3sc(N)nc23)c(-c2nnn[nH]2)c1S(N)(=O)=O