Reaction Details
TargetMetallo-beta-lactamase type 2
LigandBDBM360985
Substrate/Competitorn/a
IC50 0.019±n/a nM
Citation Bennett, FJiang, JPasternak, ADong, SGu, XScott, JDTang, HZhao, ZHuang, YYang, DYoung, KXiao, LZhang, ZFu, J Metallo-beta-lactamase inhibitors US Patent US10544130 Publication Date 1/28/2020
 
Metallo-beta-lactamase type 2
Name:Metallo-beta-lactamase type 2
Type:PROTEIN
Mol. Mass.:28498.15
Organism:Klebsiella pneumoniae
Description:ChEMBL_103887
Residue:270
BDBM360985
NameBDBM360985
Synonyms:4'-((4R,5S)-4-methyl-2- oxooxazolidin-5-yl)-N4-((R)- pyrrolidin-3-yl)-2-(1H-tetrazol- 5-yl)-[1,1'-biphenyl]-3,4- disulfonamide US10544130, Example 141
TypeSmall organic molecule
Emp. Form.C21H24N8O6S2
Mol. Mass.548.595
SMILESC[C@H]1NC(=O)O[C@H]1c1ccc(cc1)-c1ccc(c(c1-c1nnn[nH]1)S(N)(=O)=O)S(=O)(=O)N[C@@H]1CCNC1