Reaction Details
TargetComplement factor D
LigandBDBM303039
Substrate/Competitorn/a
Meas. Tech.Inhibition Assay
IC50<1000±n/a nM
Citation Wiles, JAPhadke, ASDeshpande, MAgarwal, AChen, DGadhachanda, VRHashimoto, APais, GWang, QWang, X Amino compounds for treatment of medical disorders US Patent US10660876 Publication Date 5/26/2020
 
Complement factor D
Name:Complement factor D
Type:Protein
Mol. Mass.:27039.19
Organism:Homo sapiens (Human)
Description:P00746
Residue:253
BDBM303039
NameBDBM303039
Synonyms:(2S,4R)-1-(2-(3- acetyl-5-(pyrimidin-5- ylamino)-1H-indol-1- yl)acetyl)-N-(5- bromopyrimidin-2- yl)-4- fluoropyrrolidine-2- carboxamide US9598446, Compound 44
TypeSmall organic molecule
Emp. Form.C25H22BrFN8O3
Mol. Mass.581.396
SMILESCC(=O)c1cn(CC(=O)N2C[C@H](F)C[C@H]2C(=O)Nc2ncc(Br)cn2)c2ccc(Nc3cncnc3)cc12