Reaction Details
TargetTyrosine-protein kinase BTK
LigandBDBM377827
Substrate/Competitorn/a
Meas. Tech.LanthaScreen Assay
IC50 9.90±n/a nM
Citation Springer, JRDevadas, BGarland, DJGrapperhaus, MLHan, SHockerman, SLHughes, ROSaiah, ESchnute, MESelness, SRWalker, DPWan, ZXing, LZapf, CWSchmidt, MA Bruton's tyrosine kinase inhibitors US Patent US10815213 Publication Date 10/27/2020
 
Tyrosine-protein kinase BTK
Name:Tyrosine-protein kinase BTK
Type:Enzyme
Mol. Mass.:76289.95
Organism:Homo sapiens (Human)
Description:Q06187
Residue:659
BDBM377827
NameBDBM377827
Synonyms:5-amino-1-[(3R*,6S*)-1-cyano-6-methylpiperidin-3-yl]-3-[4-(2,4-difluorophenoxy)phenyl]-1H-pyrazole-4-carboxamide US10266513, Example 122 | US10815213, Example 122
TypeSmall organic molecule
Emp. Form.C23H22F2N6O2
Mol. Mass.452.4566
SMILESC[C@H]1CC[C@H](CN1C#N)n1nc(c(C(N)=O)c1N)-c1ccc(Oc2ccc(F)cc2F)cc1