Reaction Details
TargetReplicase polyprotein 1ab
LigandBDBM47876
Substrate/Competitorn/a
Meas. Tech.RapidFire MPro inhibition assay
IC50 10400±n/a nM
Citation Achdout, HAimon, ABar-David, EBarr, HBen-Shmuel, ABennett, JBoby, MLBorden, BBowman, GRBrun, JBVNBS, SCalmiano, MCarbery, ACattermole, EChernyshenko, EChodera, JDClyde, ACoffland, JECohen, GCole, JContini, ACox, LCvitkovic, MDias, ADonckers, KDotson, DLDouangamath, ADuberstein, SDudgeon, TDunnett, LEastman, PKErez, NEyermann, CJFairhead, MFate, GFearon, DFedorov, OFerla, MFernandes, RSFerrins, LFoster, RFoster, HGabizon, RGarcia-Sastre, AGawriljuk, VOGehrtz, PGileadi, CGiroud, CGlass, WGGlen, RGlinert, IGodoy, ASGorichko, MGorrie-Stone, TGriffen, EJHart, SHHeer, JHenry, MHill, MHorrell, SHurley, MFIsraely, TJajack, AJnoff, EJochmans, DJohn, TJonghe, SDKantsadi, ALKenny, PWKiappes, JLKoekemoer, LKovar, BKrojer, TLee, AALefker, BALevy, HLondon, NLukacik, PMacdonald, HBMacLean, BMalla, TRMatviiuk, TMcCorkindale, WMcGovern, BLMelamed, SMichurin, OMikolajek, HMilne, BFMorris, AMorris, GMMorwitzer, MJMoustakas, DNakamura, AMNeto, JBNeyts, JNguyen, LNoske, GDOleinikovas, VOliva, GOverheul, GJOwen, DPsenak, VPai, RPan, JParan, NPerry, BPingle, MPinjari, JPoliti, BPowell, APuni, RRangel, VLReddi, RNReid, SPResnick, ERipka, EGRobinson, MCRobinson, RPRodriguez-Guerra, JRosales, RRufa, DSchofield, CShafeev, MShaikh, AShi, JShurrush, KSingh, SSittner, ASkyner, RSmalley, ASmilova, MDSolmesky, LJSpencer, JStrain-Damerell, CSwamy, VTamir, HTennant, RThompson, WThompson, AThompson, WTomasio, STumber, AVakonakis, Ivan Rij, RPVangeel, LVarghese, FSVaschetto, MVitner, EBVoelz, VVolkamer, Avon Delft, Fvon Delft, AWalsh, MWard, WWeatherall, CWeiss, SWhite, KMWild, CFWittmann, MWright, NYahalom-Ronen, YZaidmann, DZidane, HZitzmann, N Open Science Discovery of Oral Non-Covalent SARS-CoV-2 Main Protease Inhibitor Therapeutics bioRxiv2021:0 (2021)  
 
Replicase polyprotein 1ab
Name:Replicase polyprotein 1ab
Type:Protein
Mol. Mass.:794070.71
Organism:2019-nCoV
Description:P0DTD1
Residue:7096
BDBM47876
NameBDBM47876
Synonyms:4-(4-phenylpiperazin-1-yl)carbonyl-1H-quinolin-2-one 4-(4-phenylpiperazine-1-carbonyl)carbostyril CVD-0002709 MLS001033759 cid_2083510
TypeSmall organic molecule
Emp. Form.C20H19N3O2
Mol. Mass.333.3838
SMILESO=C(N1CCN(CC1)c1ccccc1)c1cc(=O)[nH]c2ccccc12