Reaction Details
TargetAcetylcholinesterase
LigandBDBM10489
Substrate/CompetitorBDBM8959
Meas. Tech.Enzyme Inhibition Assay
pH7.8±n/a
Temperature295.15±n/a K
IC50 12±n/a nM
Citation Doucet-Personeni, CBentley, PDFletcher, RJKinkaid, AKryger, GPirard, BTaylor, ATaylor, RTaylor, JViner, RSilman, ISussman, JLGreenblatt, HMLewis, T A structure-based design approach to the development of novel, reversible AChE inhibitors. J Med Chem44:3203-15 (2001) 
 
Acetylcholinesterase
Name:Acetylcholinesterase
Type:n/a
Mol. Mass.:65900.74
Organism:Tetronarce californica (Pacific electric ray) (Torpedo californica)
Description:P04058
Residue:586
BDBM10489
BDBM8959
NameBDBM10489
Synonyms:1-(5-{[(1-chloro-7,8,9,10-tetrahydro-6H-cyclohepta[b]quinolin-11-yl)amino]methyl}thien-2-yl)-2,2,2-trifluoroethanone N-Alkylated Tacrine Analogue 4
TypeSmall organic molecule
Emp. Form.C21H18ClF3N2OS
Mol. Mass.438.894
SMILESFC(F)(F)C(=O)c1ccc(CNc2c3CCCCCc3nc3cccc(Cl)c23)s1