Reaction Details
TargetProtein O-GlcNAcase
LigandBDBM314787
Substrate/Competitorn/a
Meas. Tech.Enzymatic Assay
Ki 0.610±n/a nM
Citation Selnick, HGLi, WHostetler, ELiu, KMcEachern, EJZhou, YWei, ZMu, CWang, YChang, J Permeable glycosidase inhibitors and uses thereof US Patent US9611275 Publication Date 4/4/2017
 
Protein O-GlcNAcase
Name:Protein O-GlcNAcase
Type:Enzyme
Mol. Mass.:102874.67
Organism:Homo sapiens (Human)
Description:O60502
Residue:916
BDBM314787
NameBDBM314787
Synonyms:(3aR,5S,6S,7R,7aR)-2- (dimethylamino)-5-((R)-2,2,2- trifluoro-1-(4-(2- fluoroethyl)benzyloxy)ethyl)- 5,6,7,7a-tetrahydro-3aH- pyrano[3,2-d]thiazole-6,7-diol | US9611275, Example 70
TypeSmall organic molecule
Emp. Form.C19H24F4N2O4S
Mol. Mass.452.463
SMILESCN(C)C1=N[C@H]2[C@H](O[C@H]([C@@H](OCc3ccc(CCF)cc3)C(F)(F)F)[C@@H](O)[C@@H]2O)S1