Reaction Details
TargetCoagulation factor X
LigandBDBM12747
Substrate/CompetitorBDBM12658
Meas. Tech.Enzyme Assay and Determination of the Inhibition Constants.
pH7±n/a
Temperature295.15±n/a K
Ki 0.18±n/a nM
Citation Pinto, DJGalemmo, RAQuan, MLOrwat, MJClark, CLi, RWells, BWoerner, FAlexander, RSRossi, KASmallwood, AWong, PCLuettgen, JMRendina, ARKnabb, RMHe, KWexler, RRLam, PY Discovery of potent, efficacious, and orally bioavailable inhibitors of blood coagulation factor Xa with neutral P1 moieties. Bioorg Med Chem Lett16:5584-9 (2006) 
 
Coagulation factor X
Name:Coagulation factor X
Type:Enzyme
Mol. Mass.:54726.60
Organism:Homo sapiens (Human)
Description:n/a
Residue:488
BDBM12747
BDBM12658
NameBDBM12747
Synonyms:2-{6-[4-(2-methanesulfonylphenyl)phenyl]-7-oxo-3-(trifluoromethyl)-1H,4H,5H,6H,7H-pyrazolo[3,4-c]pyridin-1-yl}-5-methoxybenzamide | dihydropyrazolopyridinone analogue 8d
TypeSmall organic molecule
Emp. Form.C28H23F3N4O5S
Mol. Mass.584.566
SMILESCOc1ccc(c(c1)C(N)=O)-n1nc(c2CCN(C(=O)c12)c1ccc(cc1)-c1ccccc1S(C)(=O)=O)C(F)(F)F