Reaction Details
TargetNuclear receptor ROR-gamma
LigandBDBM339272
Substrate/Competitorn/a
Meas. Tech.RORgammat ThermoFluor Assay
IC50 3.10±n/a nM
Citation Leonard, KABarbay, KEdwards, JPKreutter, KDKummer, DAMaharoof, UNishimura, RUrbanski, MVenkatesan, HWang, AWolin, RLWoods, CRFourie, AXue, XCummings, MDMcClure, KTanis, V Quinolinyl modulators of RORγt US Patent US10201546 Publication Date 2/12/2019
 
Nuclear receptor ROR-gamma
Name:Nuclear receptor ROR-gamma
Type:Enzyme Catalytic Domain
Mol. Mass.:58218.40
Organism:Homo sapiens (Human)
Description:P51449
Residue:518
BDBM339272
NameBDBM339272
Synonyms:US10201546, Example 134c
TypeSmall organic molecule
Emp. Form.C23H27ClN6O2
Mol. Mass.454.952
SMILESCOc1nc2ccc(cc2c(Cl)c1CC(C)C)[C@](O)(c1cnnn1C)c1cnc(C)n1C