Reaction Details
TargetPhosphatidylinositol 4,5-bisphosphate 3-kinase catalytic subunit delta isoform
LigandBDBM204083
Substrate/Competitorn/a
Meas. Tech.Inhibition Assay
Temperature298.15±n/a K
IC50<3.00±n/a nM
Commentsextracted
Citation Caravatti, GChamoin, SFuret, PHogenauer, KHurth, KKammertoens, KLewis, IMoebitz, HSmith, ABSoldermann, NWolf, RZecri, F Dihydro-benzo-oxazine and dihydro-pyrido-oxazine derivatives US Patent US9539260 Publication Date 1/10/2017
 
Phosphatidylinositol 4,5-bisphosphate 3-kinase catalytic subunit delta isoform
Name:Phosphatidylinositol 4,5-bisphosphate 3-kinase catalytic subunit delta isoform
Type:Enzyme Subunit
Mol. Mass.:119489.41
Organism:Homo sapiens (Human)
Description:O00329
Residue:1044
BDBM204083
NameBDBM204083
Synonyms:US9539260, E11 | US9763952, Example E11
TypeSmall organic molecule
Emp. Form.C22H24F2N4O4
Mol. Mass.446.4472
SMILESCc1cc(cnc1OC(F)F)N1CCOc2cnc(O[C@H]3CCN(C3)C(=O)C3CC3)cc12