Reaction Details
TargetPhosphatidylinositol 4,5-bisphosphate 3-kinase catalytic subunit delta isoform
LigandBDBM203381
Substrate/Competitorn/a
IC50 3.00±n/a nM
Citation Caravatti, GChamoin, SFuret, PHogenauer, KHurth, KKammertoens, KLewis, IMoebitz, HSmith, ABSoldermann, NWolf, RZecri, F Dihydro-benzo-oxazine and dihydro-pyrido-oxazine derivatives US Patent US9763952 Publication Date 9/19/2017
 
Phosphatidylinositol 4,5-bisphosphate 3-kinase catalytic subunit delta isoform
Name:Phosphatidylinositol 4,5-bisphosphate 3-kinase catalytic subunit delta isoform
Type:Enzyme Subunit
Mol. Mass.:119489.41
Organism:Homo sapiens (Human)
Description:O00329
Residue:1044
BDBM203381
NameBDBM203381
Synonyms:US9539260, B38 | US9763952, Example B38
TypeSmall organic molecule
Emp. Form.C25H31N3O6
Mol. Mass.469.5301
SMILESCOc1cc(cnc1OC)N1CCOc2ccc(O[C@H]3CCN(C3)C(=O)C3CCOCC3)cc12