Reaction Details
TargetPhosphatidylinositol 4,5-bisphosphate 3-kinase catalytic subunit delta isoform
LigandBDBM341005
Substrate/Competitorn/a
IC50 3.00±n/a nM
Citation Caravatti, GChamoin, SFuret, PHogenauer, KHurth, KKammertoens, KLewis, IMoebitz, HSmith, ABSoldermann, NWolf, RZecri, F Dihydro-benzo-oxazine and dihydro-pyrido-oxazine derivatives US Patent US9763952 Publication Date 9/19/2017
 
Phosphatidylinositol 4,5-bisphosphate 3-kinase catalytic subunit delta isoform
Name:Phosphatidylinositol 4,5-bisphosphate 3-kinase catalytic subunit delta isoform
Type:Enzyme Subunit
Mol. Mass.:119489.41
Organism:Homo sapiens (Human)
Description:O00329
Residue:1044
BDBM341005
NameBDBM341005
Synonyms:US9763952, Example E1 {(S)-3-[1-(6-Methoxy-5-methyl-pyridin-3-yl)-2,3-dihydro-1H-pyrido[3,4-b][1,4]oxazin-7-yloxy]-pyrrolidin-1-yl}-(1-methyl-1H-imidazol-4-yl)-methanone (according to Scheme 5)
TypeSmall organic molecule
Emp. Form.C23H30N4O5
Mol. Mass.442.5081
SMILESCOc1ncc(cc1C)N1CCOc2cnc(O[C@H]3CCN(C3)C(=O)OC(C)(C)C)cc12