Reaction Details
TargetPhosphatidylinositol 4,5-bisphosphate 3-kinase catalytic subunit delta isoform
LigandBDBM204090
Substrate/Competitorn/a
IC50<3.00±n/a nM
Citation Caravatti, GChamoin, SFuret, PHogenauer, KHurth, KKammertoens, KLewis, IMoebitz, HSmith, ABSoldermann, NWolf, RZecri, F Dihydro-benzo-oxazine and dihydro-pyrido-oxazine derivatives US Patent US9763952 Publication Date 9/19/2017
 
Phosphatidylinositol 4,5-bisphosphate 3-kinase catalytic subunit delta isoform
Name:Phosphatidylinositol 4,5-bisphosphate 3-kinase catalytic subunit delta isoform
Type:Enzyme Subunit
Mol. Mass.:119489.41
Organism:Homo sapiens (Human)
Description:O00329
Residue:1044
BDBM204090
NameBDBM204090
Synonyms:US9539260, F7 | US9763952, Example F7
TypeSmall organic molecule
Emp. Form.C24H28F2N4O6S
Mol. Mass.538.564
SMILESCOc1ncc(cc1C(F)F)N1CCOc2cnc(O[C@H]3CCN(C3)C(=O)C3CCS(=O)(=O)CC3)cc12