Reaction Details
TargetPhosphatidylinositol 4,5-bisphosphate 3-kinase catalytic subunit delta isoform
LigandBDBM204093
Substrate/Competitorn/a
IC50<3.00±n/a nM
Citation Caravatti, GChamoin, SFuret, PHogenauer, KHurth, KKammertoens, KLewis, IMoebitz, HSmith, ABSoldermann, NWolf, RZecri, F Dihydro-benzo-oxazine and dihydro-pyrido-oxazine derivatives US Patent US9763952 Publication Date 9/19/2017
 
Phosphatidylinositol 4,5-bisphosphate 3-kinase catalytic subunit delta isoform
Name:Phosphatidylinositol 4,5-bisphosphate 3-kinase catalytic subunit delta isoform
Type:Enzyme Subunit
Mol. Mass.:119489.41
Organism:Homo sapiens (Human)
Description:O00329
Residue:1044
BDBM204093
NameBDBM204093
Synonyms:US9539260, F10 | US9763952, Example F10
TypeSmall organic molecule
Emp. Form.C23H24F2N6O4
Mol. Mass.486.4713
SMILESCOc1ncc(cc1C(F)F)N1CCOc2cnc(O[C@H]3CCN(C3)C(=O)c3cn(C)cn3)cc12