Reaction Details
TargetPhosphatidylinositol 4,5-bisphosphate 3-kinase catalytic subunit delta isoform
LigandBDBM204120
Substrate/Competitorn/a
IC50<3.00±n/a nM
Citation Caravatti, GChamoin, SFuret, PHogenauer, KHurth, KKammertoens, KLewis, IMoebitz, HSmith, ABSoldermann, NWolf, RZecri, F Dihydro-benzo-oxazine and dihydro-pyrido-oxazine derivatives US Patent US9763952 Publication Date 9/19/2017
 
Phosphatidylinositol 4,5-bisphosphate 3-kinase catalytic subunit delta isoform
Name:Phosphatidylinositol 4,5-bisphosphate 3-kinase catalytic subunit delta isoform
Type:Enzyme Subunit
Mol. Mass.:119489.41
Organism:Homo sapiens (Human)
Description:O00329
Residue:1044
BDBM204120
NameBDBM204120
Synonyms:US9539260, K | US9763952, Example K
TypeSmall organic molecule
Emp. Form.C26H29N5O5
Mol. Mass.491.539
SMILESCOc1ncc(cc1C#N)N1CCOc2ccc(O[C@H]3CCN(C3)C(=O)[C@@H]3CCN(C3)C(C)=O)cc12