Reaction Details
TargetOxysterols receptor LXR-beta [154-461]
LigandBDBM20004
Substrate/CompetitorBDBM19993
Meas. Tech.LXR Binding Assay
IC50 2.4±n/a nM
EC50 29±n/a nM
Citation Hu, BJetter, JKaufman, DSinghaus, RBernotas, RUnwalla, RQuinet, ESavio, DHalpern, ABasso, MKeith, JClerin, VChen, LLiu, QYFeingold, IHuselton, CAzam, FGoos-Nilsson, AWilhelmsson, ANambi, PWrobel, J Further modification on phenyl acetic acid based quinolines as liver X receptor modulators. Bioorg Med Chem15:3321-33 (2007) 
 
Oxysterols receptor LXR-beta [154-461]
Name:Oxysterols receptor LXR-beta [154-461]
Type:Receptor
Mol. Mass.:34695.52
Organism:Homo sapiens (Human)
Description:LXR beta ligand binding domain (amino acid residues 154-461) with an N-terminal biotinylation tag expressed in E.coli, was used for the binding assays.
Residue:308
BDBM20004
BDBM19993
NameBDBM20004
Synonyms:2-{4-[({3-[3-benzoyl-8-(trifluoromethyl)quinolin-4-yl]phenyl}amino)methyl]phenyl}acetic acid | phenyl acetic acid based quinoline, 16
TypeSmall organic molecule
Emp. Form.C32H23F3N2O3
Mol. Mass.540.5318
SMILESOC(=O)Cc1ccc(CNc2cccc(c2)-c2c(cnc3c(cccc23)C(F)(F)F)C(=O)c2ccccc2)cc1