Reaction Details
TargetOxysterols receptor LXR-beta [154-461]
LigandBDBM20015
Substrate/CompetitorBDBM19993
Meas. Tech.LXR Binding Assay
IC50 1.4±n/a nM
EC50 23±n/a nM
Citation Hu, BJetter, JKaufman, DSinghaus, RBernotas, RUnwalla, RQuinet, ESavio, DHalpern, ABasso, MKeith, JClerin, VChen, LLiu, QYFeingold, IHuselton, CAzam, FGoos-Nilsson, AWilhelmsson, ANambi, PWrobel, J Further modification on phenyl acetic acid based quinolines as liver X receptor modulators. Bioorg Med Chem15:3321-33 (2007) 
 
Oxysterols receptor LXR-beta [154-461]
Name:Oxysterols receptor LXR-beta [154-461]
Type:Receptor
Mol. Mass.:34695.52
Organism:Homo sapiens (Human)
Description:LXR beta ligand binding domain (amino acid residues 154-461) with an N-terminal biotinylation tag expressed in E.coli, was used for the binding assays.
Residue:308
BDBM20015
BDBM19993
NameBDBM20015
Synonyms:2-[4-({[3-(3-benzyl-8-chloroquinolin-4-yl)phenyl]amino}methyl)phenyl]acetic acid | phenyl acetic acid based quinoline, 27
TypeSmall organic molecule
Emp. Form.C31H25ClN2O2
Mol. Mass.492.995
SMILESOC(=O)Cc1ccc(CNc2cccc(c2)-c2c(Cc3ccccc3)cnc3c(Cl)cccc23)cc1