Reaction Details
TargetSphingosine 1-phosphate receptor 5
LigandBDBM22219
Substrate/CompetitorBDBM22202
Meas. Tech.S1P Receptor Binding Assay
Temperature298.15±n/a K
IC50 0.5±n/a nM
Commentsextracted
Citation Li, ZChen, WHale, JJLynch, CLMills, SGHajdu, RKeohane, CARosenbach, MJMilligan, JAShei, GJChrebet, GParent, SABergstrom, JCard, DForrest, MQuackenbush, EJWickham, LAVargas, HEvans, RMRosen, HMandala, S Discovery of potent 3,5-diphenyl-1,2,4-oxadiazole sphingosine-1-phosphate-1 (S1P1) receptor agonists with exceptional selectivity against S1P2 and S1P3. J Med Chem48:6169-73 (2005) 
 
Sphingosine 1-phosphate receptor 5
Name:Sphingosine 1-phosphate receptor 5
Type:G Protein-Coupled Receptor (GPCR)
Mol. Mass.:41796.42
Organism:Homo sapiens (Human)
Description:n/a
Residue:398
BDBM22219
BDBM22202
NameBDBM22219
Synonyms:1,2,4-oxadiazole based compound, 36 | 1-{[4-(5-{4-[(1S)-3,3-difluorocyclopentyl]phenyl}-1,2,4-oxadiazol-3-yl)phenyl]methyl}azetidine-3-carboxylic acid
TypeSmall organic molecule
Emp. Form.C24H23F2N3O3
Mol. Mass.439.4545
SMILESOC(=O)C1CN(Cc2ccc(cc2)-c2noc(n2)-c2ccc(cc2)[C@H]2CCC(F)(F)C2)C1