Reaction Details
TargetLeukotriene A-4 hydrolase
LigandBDBM24202
Substrate/CompetitorBDBM24200
Meas. Tech.Epoxide Hydrolase Assay
pH7.4±n/a
Temperature295.15±n/a K
IC50 84±9 nM
Citation Grice, CATays, KLSavall, BMWei, JButler, CRAxe, FUBembenek, SDFourie, AMDunford, PJLundeen, KColes, FXue, XRiley, JPWilliams, KNKarlsson, LEdwards, JP Identification of a potent, selective, and orally active leukotriene a4 hydrolase inhibitor with anti-inflammatory activity. J Med Chem51:4150-69 (2008) 
 
Leukotriene A-4 hydrolase
Name:Leukotriene A-4 hydrolase
Type:Hydrolase; metalloprotease
Mol. Mass.:69280.41
Organism:Homo sapiens (Human)
Description:Human recombinant LTA4H.
Residue:611
BDBM24202
BDBM24200
NameBDBM24202
Synonyms:2-{4-[2-(pyrrolidin-1-yl)ethoxy]phenoxy}-1H-1,3-benzodiazole | Benzimidazole compound, 13a
TypeSmall organic molecule
Emp. Form.C19H21N3O2
Mol. Mass.323.3889
SMILESC(CN1CCCC1)Oc1ccc(Oc2nc3ccccc3[nH]2)cc1