Reaction Details
TargetLeukotriene A-4 hydrolase
LigandBDBM24208
Substrate/CompetitorBDBM24200
Meas. Tech.Epoxide Hydrolase Assay
pH7.4±n/a
Temperature295.15±n/a K
IC50 140±65 nM
Citation Grice, CATays, KLSavall, BMWei, JButler, CRAxe, FUBembenek, SDFourie, AMDunford, PJLundeen, KColes, FXue, XRiley, JPWilliams, KNKarlsson, LEdwards, JP Identification of a potent, selective, and orally active leukotriene a4 hydrolase inhibitor with anti-inflammatory activity. J Med Chem51:4150-69 (2008) 
 
Leukotriene A-4 hydrolase
Name:Leukotriene A-4 hydrolase
Type:Hydrolase; metalloprotease
Mol. Mass.:69280.41
Organism:Homo sapiens (Human)
Description:Human recombinant LTA4H.
Residue:611
BDBM24208
BDBM24200
NameBDBM24208
Synonyms:2-{4-[2-(azepan-1-yl)ethoxy]phenoxy}-1H-1,3-benzodiazole | Benzimidazole compound, 13c
TypeSmall organic molecule
Emp. Form.C21H25N3O2
Mol. Mass.351.4421
SMILESC(CN1CCCCCC1)Oc1ccc(Oc2nc3ccccc3[nH]2)cc1