Reaction Details
TargetLeukotriene A-4 hydrolase
LigandBDBM24214
Substrate/CompetitorBDBM24200
Meas. Tech.Epoxide Hydrolase Assay
pH7.4±n/a
Temperature295.15±n/a K
IC50 14±7 nM
Citation Grice, CATays, KLSavall, BMWei, JButler, CRAxe, FUBembenek, SDFourie, AMDunford, PJLundeen, KColes, FXue, XRiley, JPWilliams, KNKarlsson, LEdwards, JP Identification of a potent, selective, and orally active leukotriene a4 hydrolase inhibitor with anti-inflammatory activity. J Med Chem51:4150-69 (2008) 
 
Leukotriene A-4 hydrolase
Name:Leukotriene A-4 hydrolase
Type:Hydrolase; metalloprotease
Mol. Mass.:69280.41
Organism:Homo sapiens (Human)
Description:Human recombinant LTA4H.
Residue:611
BDBM24214
BDBM24200
NameBDBM24214
Synonyms:(1-{2-[4-(1,3-benzoxazol-2-yloxy)phenoxy]ethyl}piperidin-4-yl)methanol | Benzoxazole compound, 10f
TypeSmall organic molecule
Emp. Form.C21H24N2O4
Mol. Mass.368.4263
SMILESOCC1CCN(CCOc2ccc(Oc3nc4ccccc4o3)cc2)CC1