Reaction Details
TargetLeukotriene A-4 hydrolase
LigandBDBM24217
Substrate/CompetitorBDBM24200
Meas. Tech.Epoxide Hydrolase Assay
pH7.4±n/a
Temperature295.15±n/a K
IC50 66±33 nM
Citation Grice, CATays, KLSavall, BMWei, JButler, CRAxe, FUBembenek, SDFourie, AMDunford, PJLundeen, KColes, FXue, XRiley, JPWilliams, KNKarlsson, LEdwards, JP Identification of a potent, selective, and orally active leukotriene a4 hydrolase inhibitor with anti-inflammatory activity. J Med Chem51:4150-69 (2008) 
 
Leukotriene A-4 hydrolase
Name:Leukotriene A-4 hydrolase
Type:Hydrolase; metalloprotease
Mol. Mass.:69280.41
Organism:Homo sapiens (Human)
Description:Human recombinant LTA4H.
Residue:611
BDBM24217
BDBM24200
NameBDBM24217
Synonyms:1-{2-[4-(1,3-benzothiazol-2-yloxy)phenoxy]ethyl}-4-phenylpiperidin-4-ol | Benzthiazole compound, 11g
TypeSmall organic molecule
Emp. Form.C26H26N2O3S
Mol. Mass.446.561
SMILESOC1(CCN(CCOc2ccc(Oc3nc4ccccc4s3)cc2)CC1)c1ccccc1