Reaction Details
TargetLeukotriene A-4 hydrolase
LigandBDBM24223
Substrate/CompetitorBDBM24200
Meas. Tech.Epoxide Hydrolase Assay
pH7.4±n/a
Temperature295.15±n/a K
IC50 17±6 nM
Citation Grice, CATays, KLSavall, BMWei, JButler, CRAxe, FUBembenek, SDFourie, AMDunford, PJLundeen, KColes, FXue, XRiley, JPWilliams, KNKarlsson, LEdwards, JP Identification of a potent, selective, and orally active leukotriene a4 hydrolase inhibitor with anti-inflammatory activity. J Med Chem51:4150-69 (2008) 
 
Leukotriene A-4 hydrolase
Name:Leukotriene A-4 hydrolase
Type:Hydrolase; metalloprotease
Mol. Mass.:69280.41
Organism:Homo sapiens (Human)
Description:Human recombinant LTA4H.
Residue:611
BDBM24223
BDBM24200
NameBDBM24223
Synonyms:2-{4-[2-(piperidin-1-yl)ethyl]phenoxy}-1,3-benzothiazole | Benzthiazole compound, 27b
TypeSmall organic molecule
Emp. Form.C20H22N2OS
Mol. Mass.338.466
SMILESC(Cc1ccc(Oc2nc3ccccc3s2)cc1)N1CCCCC1