Reaction Details
TargetLeukotriene A-4 hydrolase
LigandBDBM24228
Substrate/CompetitorBDBM24200
Meas. Tech.Epoxide Hydrolase Assay
Temperature298.15±n/a K
IC50 29±n/a nM
Commentsextracted
Citation Grice, CATays, KLSavall, BMWei, JButler, CRAxe, FUBembenek, SDFourie, AMDunford, PJLundeen, KColes, FXue, XRiley, JPWilliams, KNKarlsson, LEdwards, JP Identification of a potent, selective, and orally active leukotriene a4 hydrolase inhibitor with anti-inflammatory activity. J Med Chem51:4150-69 (2008) 
 
Leukotriene A-4 hydrolase
Name:Leukotriene A-4 hydrolase
Type:Hydrolase; metalloprotease
Mol. Mass.:69280.41
Organism:Homo sapiens (Human)
Description:Human recombinant LTA4H.
Residue:611
BDBM24228
BDBM24200
NameBDBM24228
Synonyms:3-(1-{2-[4-(1,3-benzothiazol-2-yloxy)phenyl]ethyl}piperidin-4-yl)-1,3-oxazolidin-2-one | Benzthiazole compound, 27l
TypeSmall organic molecule
Emp. Form.C23H25N3O3S
Mol. Mass.423.528
SMILESO=C1OCCN1C1CCN(CCc2ccc(Oc3nc4ccccc4s3)cc2)CC1