Reaction Details
TargetLeukotriene A-4 hydrolase
LigandBDBM24231
Substrate/CompetitorBDBM24200
Meas. Tech.Epoxide Hydrolase Assay
Temperature298.15±n/a K
IC50 59±n/a nM
Commentsextracted
Citation Grice, CATays, KLSavall, BMWei, JButler, CRAxe, FUBembenek, SDFourie, AMDunford, PJLundeen, KColes, FXue, XRiley, JPWilliams, KNKarlsson, LEdwards, JP Identification of a potent, selective, and orally active leukotriene a4 hydrolase inhibitor with anti-inflammatory activity. J Med Chem51:4150-69 (2008) 
 
Leukotriene A-4 hydrolase
Name:Leukotriene A-4 hydrolase
Type:Hydrolase; metalloprotease
Mol. Mass.:69280.41
Organism:Homo sapiens (Human)
Description:Human recombinant LTA4H.
Residue:611
BDBM24231
BDBM24200
NameBDBM24231
Synonyms:2-[4-(piperidin-1-ylmethyl)phenoxy]-1,3-benzothiazole | Benzthiazole compound, 33b
TypeSmall organic molecule
Emp. Form.C19H20N2OS
Mol. Mass.324.44
SMILESC(N1CCCCC1)c1ccc(Oc2nc3ccccc3s2)cc1