Reaction Details
TargetLeukotriene A-4 hydrolase
LigandBDBM24232
Substrate/CompetitorBDBM24200
Meas. Tech.Epoxide Hydrolase Assay
Temperature298.15±n/a K
IC50 34±n/a nM
Commentsextracted
Citation Grice, CATays, KLSavall, BMWei, JButler, CRAxe, FUBembenek, SDFourie, AMDunford, PJLundeen, KColes, FXue, XRiley, JPWilliams, KNKarlsson, LEdwards, JP Identification of a potent, selective, and orally active leukotriene a4 hydrolase inhibitor with anti-inflammatory activity. J Med Chem51:4150-69 (2008) 
 
Leukotriene A-4 hydrolase
Name:Leukotriene A-4 hydrolase
Type:Hydrolase; metalloprotease
Mol. Mass.:69280.41
Organism:Homo sapiens (Human)
Description:Human recombinant LTA4H.
Residue:611
BDBM24232
BDBM24200
NameBDBM24232
Synonyms:1-{[4-(1,3-benzothiazol-2-yloxy)phenyl]methyl}piperidin-4-ol | Benzthiazole compound, 33e
TypeSmall organic molecule
Emp. Form.C19H20N2O2S
Mol. Mass.340.439
SMILESOC1CCN(Cc2ccc(Oc3nc4ccccc4s3)cc2)CC1