Reaction Details
TargetLeukotriene A-4 hydrolase
LigandBDBM24233
Substrate/CompetitorBDBM24200
Meas. Tech.Epoxide Hydrolase Assay
Temperature298.15±n/a K
IC50 17±n/a nM
Commentsextracted
Citation Grice, CATays, KLSavall, BMWei, JButler, CRAxe, FUBembenek, SDFourie, AMDunford, PJLundeen, KColes, FXue, XRiley, JPWilliams, KNKarlsson, LEdwards, JP Identification of a potent, selective, and orally active leukotriene a4 hydrolase inhibitor with anti-inflammatory activity. J Med Chem51:4150-69 (2008) 
 
Leukotriene A-4 hydrolase
Name:Leukotriene A-4 hydrolase
Type:Hydrolase; metalloprotease
Mol. Mass.:69280.41
Organism:Homo sapiens (Human)
Description:Human recombinant LTA4H.
Residue:611
BDBM24233
BDBM24200
NameBDBM24233
Synonyms:1-{[4-(1,3-benzothiazol-2-yloxy)phenyl]methyl}piperidine-4-carboxamide | Benzthiazole compound, 33h
TypeSmall organic molecule
Emp. Form.C20H21N3O2S
Mol. Mass.367.465
SMILESNC(=O)C1CCN(Cc2ccc(Oc3nc4ccccc4s3)cc2)CC1