Reaction Details
TargetLeukotriene A-4 hydrolase
LigandBDBM24235
Substrate/CompetitorBDBM24200
Meas. Tech.Epoxide Hydrolase Assay
Temperature298.15±n/a K
IC50 10±n/a nM
Commentsextracted
Citation Grice, CATays, KLSavall, BMWei, JButler, CRAxe, FUBembenek, SDFourie, AMDunford, PJLundeen, KColes, FXue, XRiley, JPWilliams, KNKarlsson, LEdwards, JP Identification of a potent, selective, and orally active leukotriene a4 hydrolase inhibitor with anti-inflammatory activity. J Med Chem51:4150-69 (2008) 
 
Leukotriene A-4 hydrolase
Name:Leukotriene A-4 hydrolase
Type:Hydrolase; metalloprotease
Mol. Mass.:69280.41
Organism:Homo sapiens (Human)
Description:Human recombinant LTA4H.
Residue:611
BDBM24235
BDBM24200
NameBDBM24235
Synonyms:3-(1-{[4-(1,3-benzothiazol-2-yloxy)phenyl]methyl}piperidin-4-yl)-1,3-oxazolidin-2-one | Benzthiazole compound, 33l
TypeSmall organic molecule
Emp. Form.C22H23N3O3S
Mol. Mass.409.501
SMILESO=C1OCCN1C1CCN(Cc2ccc(Oc3nc4ccccc4s3)cc2)CC1