Reaction Details
TargetLeukotriene A-4 hydrolase
LigandBDBM24236
Substrate/CompetitorBDBM24200
Meas. Tech.Epoxide Hydrolase Assay
Temperature298.15±n/a K
IC50 12±n/a nM
Commentsextracted
Citation Grice, CATays, KLSavall, BMWei, JButler, CRAxe, FUBembenek, SDFourie, AMDunford, PJLundeen, KColes, FXue, XRiley, JPWilliams, KNKarlsson, LEdwards, JP Identification of a potent, selective, and orally active leukotriene a4 hydrolase inhibitor with anti-inflammatory activity. J Med Chem51:4150-69 (2008) 
 
Leukotriene A-4 hydrolase
Name:Leukotriene A-4 hydrolase
Type:Hydrolase; metalloprotease
Mol. Mass.:69280.41
Organism:Homo sapiens (Human)
Description:Human recombinant LTA4H.
Residue:611
BDBM24236
BDBM24200
NameBDBM24236
Synonyms:Benzthiazole compound, 33n | N-(1-{[4-(1,3-benzothiazol-2-yloxy)phenyl]methyl}piperidin-4-yl)acetamide
TypeSmall organic molecule
Emp. Form.C21H23N3O2S
Mol. Mass.381.491
SMILESCC(=O)NC1CCN(Cc2ccc(Oc3nc4ccccc4s3)cc2)CC1