Reaction Details
TargetLeukotriene A-4 hydrolase
LigandBDBM24241
Substrate/CompetitorBDBM24200
Meas. Tech.Epoxide Hydrolase Assay
Temperature298.15±n/a K
IC50 87±n/a nM
Commentsextracted
Citation Grice, CATays, KLSavall, BMWei, JButler, CRAxe, FUBembenek, SDFourie, AMDunford, PJLundeen, KColes, FXue, XRiley, JPWilliams, KNKarlsson, LEdwards, JP Identification of a potent, selective, and orally active leukotriene a4 hydrolase inhibitor with anti-inflammatory activity. J Med Chem51:4150-69 (2008) 
 
Leukotriene A-4 hydrolase
Name:Leukotriene A-4 hydrolase
Type:Hydrolase; metalloprotease
Mol. Mass.:69280.41
Organism:Homo sapiens (Human)
Description:Human recombinant LTA4H.
Residue:611
BDBM24241
BDBM24200
NameBDBM24241
Synonyms:2-{4-[3-(piperidin-1-yl)propoxy]phenoxy}-1,3-benzothiazole | Benzthiazole compound, 4
TypeSmall organic molecule
Emp. Form.C21H24N2O2S
Mol. Mass.368.492
SMILESC(COc1ccc(Oc2nc3ccccc3s2)cc1)CN1CCCCC1