Reaction Details
TargetPotassium voltage-gated channel subfamily H member 2
LigandBDBM24215
Substrate/CompetitorBDBM24226
Meas. Tech.Epoxide Hydrolase Assay
Temperature298.15±n/a K
IC50 3600±n/a nM
Commentsextracted
Citation Grice, CATays, KLSavall, BMWei, JButler, CRAxe, FUBembenek, SDFourie, AMDunford, PJLundeen, KColes, FXue, XRiley, JPWilliams, KNKarlsson, LEdwards, JP Identification of a potent, selective, and orally active leukotriene a4 hydrolase inhibitor with anti-inflammatory activity. J Med Chem51:4150-69 (2008) 
 
Potassium voltage-gated channel subfamily H member 2
Name:Potassium voltage-gated channel subfamily H member 2
Type:Multi-pass membrane protein
Mol. Mass.:126672.65
Organism:Homo sapiens (Human)
Description:Q12809
Residue:1159
BDBM24215
BDBM24226
NameBDBM24215
Synonyms:(1-{2-[4-(1,3-benzothiazol-2-yloxy)phenoxy]ethyl}piperidin-4-yl)methanol | Benzthiazole compound, 11f
TypeSmall organic molecule
Emp. Form.C21H24N2O3S
Mol. Mass.384.492
SMILESOCC1CCN(CCOc2ccc(Oc3nc4ccccc4s3)cc2)CC1