Reaction Details
TargetPotassium voltage-gated channel subfamily H member 2
LigandBDBM24221
Substrate/CompetitorBDBM24226
Meas. Tech.Epoxide Hydrolase Assay
Temperature298.15±n/a K
IC50 1800±n/a nM
Commentsextracted
Citation Grice, CATays, KLSavall, BMWei, JButler, CRAxe, FUBembenek, SDFourie, AMDunford, PJLundeen, KColes, FXue, XRiley, JPWilliams, KNKarlsson, LEdwards, JP Identification of a potent, selective, and orally active leukotriene a4 hydrolase inhibitor with anti-inflammatory activity. J Med Chem51:4150-69 (2008) 
 
Potassium voltage-gated channel subfamily H member 2
Name:Potassium voltage-gated channel subfamily H member 2
Type:Multi-pass membrane protein
Mol. Mass.:126672.65
Organism:Homo sapiens (Human)
Description:Q12809
Residue:1159
BDBM24221
BDBM24226
NameBDBM24221
Synonyms:1-(1-{2-[4-(1,3-benzothiazol-2-yloxy)phenoxy]ethyl}piperidin-4-yl)piperidin-2-one | Benzthiazole compound, 11k
TypeSmall organic molecule
Emp. Form.C25H29N3O3S
Mol. Mass.451.581
SMILESO=C1CCCCN1C1CCN(CCOc2ccc(Oc3nc4ccccc4s3)cc2)CC1