Reaction Details
TargetPotassium voltage-gated channel subfamily H member 2
LigandBDBM24222
Substrate/CompetitorBDBM24226
Meas. Tech.Epoxide Hydrolase Assay
Temperature298.15±n/a K
IC50 2700±n/a nM
Commentsextracted
Citation Grice, CATays, KLSavall, BMWei, JButler, CRAxe, FUBembenek, SDFourie, AMDunford, PJLundeen, KColes, FXue, XRiley, JPWilliams, KNKarlsson, LEdwards, JP Identification of a potent, selective, and orally active leukotriene a4 hydrolase inhibitor with anti-inflammatory activity. J Med Chem51:4150-69 (2008) 
 
Potassium voltage-gated channel subfamily H member 2
Name:Potassium voltage-gated channel subfamily H member 2
Type:Multi-pass membrane protein
Mol. Mass.:126672.65
Organism:Homo sapiens (Human)
Description:Q12809
Residue:1159
BDBM24222
BDBM24226
NameBDBM24222
Synonyms:3-(1-{2-[4-(1,3-benzothiazol-2-yloxy)phenoxy]ethyl}piperidin-4-yl)-1,3-oxazolidin-2-one | Benzthiazole compound, 11l
TypeSmall organic molecule
Emp. Form.C23H25N3O4S
Mol. Mass.439.527
SMILESO=C1OCCN1C1CCN(CCOc2ccc(Oc3nc4ccccc4s3)cc2)CC1