Reaction Details
TargetOxysterols receptor LXR-beta [154-461]
LigandBDBM26065
Substrate/CompetitorBDBM19993
Meas. Tech.LXR Binding Assay and hLXR Reporter Assay
pH7.4±n/a
Temperature277.15±n/a K
IC50 10±n/a nM
EC50 990±n/a nM
Comments75% efficacy.
Citation Wrobel, JSteffan†, RBowen, SMMagolda, RMatelan†, EUnwalla†, RBasso, MClerin, VGardell, SJNambi, PQuinet, EReminick, JIVlasuk, GPWang, SFeingold, IHuselton, CBonn, T Indazole-Based Liver X Receptor (LXR) Modulators with Maintained Atherosclerotic Lesion Reduction Activity but Diminished Stimulation of Hepatic Triglyceride Synthesis J Med Chem51:7161-8 (2008) 
 
Oxysterols receptor LXR-beta [154-461]
Name:Oxysterols receptor LXR-beta [154-461]
Type:Receptor
Mol. Mass.:34695.52
Organism:Homo sapiens (Human)
Description:LXR beta ligand binding domain (amino acid residues 154-461) with an N-terminal biotinylation tag expressed in E.coli, was used for the binding assays.
Residue:308
BDBM26065
BDBM19993
NameBDBM26065
Synonyms:2-[(2,4-dimethylphenyl)methyl]-3-(4-fluorophenyl)-7-(trifluoromethyl)-2H-indazole | 2-benzyl-3-aryl-7-trifluoromethylindazole, 11
TypeSmall organic molecule
Emp. Form.C23H18F4N2
Mol. Mass.398.396
SMILESCc1ccc(Cn2nc3c(cccc3c2-c2ccc(F)cc2)C(F)(F)F)c(C)c1