Reaction Details
TargetMetallo-beta-lactamase type 2
LigandBDBM262282
Substrate/Competitorn/a
Meas. Tech.Class B Enzyme Assay
pH7±n/a
IC50 0.280±n/a nM
Commentsextracted
Citation Mandal, MTang, HXiao, LSu, JLi, GYang, SPan, WTang, HDeJesus, RHicks, JLombardo, MChu, HHagmann, WPasternak, AGu, XJiang, JDong, SDing, FLondon, CBiswas, DYoung, KHunter, DNZhao, ZYang, D Metallo-beta-lactamase inhibitors US Patent US9708336 Publication Date 7/18/2017
 
Metallo-beta-lactamase type 2
Name:Metallo-beta-lactamase type 2
Type:PROTEIN
Mol. Mass.:28498.15
Organism:Klebsiella pneumoniae
Description:ChEMBL_103887
Residue:270
BDBM262282
NameBDBM262282
Synonyms:3-(2-aminobenzo[d]thiazol- 4-yl)-2-(1H-tetrazol-5- yl)benzenesulfonamide | US9708336, 134
TypeSmall organic molecule
Emp. Form.C14H11N7O2S2
Mol. Mass.373.413
SMILESNc1nc2c(cccc2s1)-c1cccc(c1-c1nnn[nH]1)S(N)(=O)=O