Reaction Details
TargetMetallo-beta-lactamase type 2
LigandBDBM262639
Substrate/Competitorn/a
Meas. Tech.Class B Enzyme Assay
pH7±n/a
IC50 0.435±n/a nM
Commentsextracted
Citation Mandal, MTang, HXiao, LSu, JLi, GYang, SPan, WTang, HDeJesus, RHicks, JLombardo, MChu, HHagmann, WPasternak, AGu, XJiang, JDong, SDing, FLondon, CBiswas, DYoung, KHunter, DNZhao, ZYang, D Metallo-beta-lactamase inhibitors US Patent US9708336 Publication Date 7/18/2017
 
Metallo-beta-lactamase type 2
Name:Metallo-beta-lactamase type 2
Type:PROTEIN
Mol. Mass.:28498.15
Organism:Klebsiella pneumoniae
Description:ChEMBL_103887
Residue:270
BDBM262639
NameBDBM262639
Synonyms:3-cyclohexyl-2-(1H-tetrazol-5-yl)-6- (trifluoromethyl)benzenesulfonamide | US9708336, 491
TypeSmall organic molecule
Emp. Form.C14H16F3N5O2S
Mol. Mass.375.369
SMILESNS(=O)(=O)c1c(ccc(C2CCCCC2)c1-c1nnn[nH]1)C(F)(F)F