Reaction Details
TargetMetallo-beta-lactamase type 2
LigandBDBM262675
Substrate/Competitorn/a
Meas. Tech.Class B Enzyme Assay
pH7±n/a
IC50 0.425±n/a nM
Commentsextracted
Citation Mandal, MTang, HXiao, LSu, JLi, GYang, SPan, WTang, HDeJesus, RHicks, JLombardo, MChu, HHagmann, WPasternak, AGu, XJiang, JDong, SDing, FLondon, CBiswas, DYoung, KHunter, DNZhao, ZYang, D Metallo-beta-lactamase inhibitors US Patent US9708336 Publication Date 7/18/2017
 
Metallo-beta-lactamase type 2
Name:Metallo-beta-lactamase type 2
Type:undefined
Mol. Mass.:27125.88
Organism:Serratia marcescens
Description:P52699
Residue:246
BDBM262675
NameBDBM262675
Synonyms:7-(3-Sulfamoyl-2-(2H-tetrazol-5-yl)- 4-(trifluoromethyl)phenyl)-1H-indole- 2-carboxamide | US9708336, 528
TypeSmall organic molecule
Emp. Form.C17H12F3N7O3S
Mol. Mass.451.382
SMILESNC(=O)c1cc2cccc(-c3ccc(c(c3-c3nn[nH]n3)S(N)(=O)=O)C(F)(F)F)c2[nH]1