Reaction Details
TargetMetallo-beta-lactamase type 2
LigandBDBM262679
Substrate/Competitorn/a
Meas. Tech.Class B Enzyme Assay
pH7±n/a
IC50 0.598±n/a nM
Commentsextracted
Citation Mandal, MTang, HXiao, LSu, JLi, GYang, SPan, WTang, HDeJesus, RHicks, JLombardo, MChu, HHagmann, WPasternak, AGu, XJiang, JDong, SDing, FLondon, CBiswas, DYoung, KHunter, DNZhao, ZYang, D Metallo-beta-lactamase inhibitors US Patent US9708336 Publication Date 7/18/2017
 
Metallo-beta-lactamase type 2
Name:Metallo-beta-lactamase type 2
Type:PROTEIN
Mol. Mass.:28498.15
Organism:Klebsiella pneumoniae
Description:ChEMBL_103887
Residue:270
BDBM262679
NameBDBM262679
Synonyms:3-(2-Aminobenzo[d]thiazol-4-yl)-6- (1-fluoro-2-hydroxyethyl)-2-(2H- tetrazol-5-yl)benzenesulfonamide | US9708336, 532
TypeSmall organic molecule
Emp. Form.C16H14FN7O3S2
Mol. Mass.435.456
SMILESNc1nc2c(cccc2s1)-c1ccc(C(F)CO)c(c1-c1nn[nH]n1)S(N)(=O)=O