Reaction Details
TargetMetallo-beta-lactamase type 2
LigandBDBM262686
Substrate/Competitorn/a
Meas. Tech.Class B Enzyme Assay
pH7±n/a
IC50 0.192±n/a nM
Commentsextracted
Citation Mandal, MTang, HXiao, LSu, JLi, GYang, SPan, WTang, HDeJesus, RHicks, JLombardo, MChu, HHagmann, WPasternak, AGu, XJiang, JDong, SDing, FLondon, CBiswas, DYoung, KHunter, DNZhao, ZYang, D Metallo-beta-lactamase inhibitors US Patent US9708336 Publication Date 7/18/2017
 
Metallo-beta-lactamase type 2
Name:Metallo-beta-lactamase type 2
Type:PROTEIN
Mol. Mass.:28498.15
Organism:Klebsiella pneumoniae
Description:ChEMBL_103887
Residue:270
BDBM262686
NameBDBM262686
Synonyms:3-(4-(2-Aminobenzo[d]thiazol-4-yl)- 2-sulfamoyl-3-(2H-tetrazol-5- yl)phenyl)propanamide | US9708336, 539
TypeSmall organic molecule
Emp. Form.C17H16N8O3S2
Mol. Mass.444.491
SMILESNC(=O)CCc1ccc(-c2cccc3sc(N)nc23)c(-c2nn[nH]n2)c1S(N)(=O)=O