Reaction Details
TargetMetallo-beta-lactamase type 2
LigandBDBM262716
Substrate/Competitorn/a
Meas. Tech.Class B Enzyme Assay
pH7±n/a
IC50 0.215±n/a nM
Commentsextracted
Citation Mandal, MTang, HXiao, LSu, JLi, GYang, SPan, WTang, HDeJesus, RHicks, JLombardo, MChu, HHagmann, WPasternak, AGu, XJiang, JDong, SDing, FLondon, CBiswas, DYoung, KHunter, DNZhao, ZYang, D Metallo-beta-lactamase inhibitors US Patent US9708336 Publication Date 7/18/2017
 
Metallo-beta-lactamase type 2
Name:Metallo-beta-lactamase type 2
Type:PROTEIN
Mol. Mass.:28498.15
Organism:Klebsiella pneumoniae
Description:ChEMBL_103887
Residue:270
BDBM262716
NameBDBM262716
Synonyms:3-(2-amino-5-cyano-1H-benzo[d]imidazol-7-yl)-2-(1H-tetrazol-5-yl)-6-(trifluoromethyl)benzenesulfonamide | US9708336, 569
TypeSmall organic molecule
Emp. Form.C16H10F3N9O2S
Mol. Mass.449.37
SMILESNc1nc2cc(cc(-c3ccc(c(c3-c3nnn[nH]3)S(N)(=O)=O)C(F)(F)F)c2[nH]1)C#N