Reaction Details
TargetMetallo-beta-lactamase type 2
LigandBDBM262973
Substrate/Competitorn/a
Meas. Tech.Class B Enzyme Assay
pH7±n/a
IC50 0.491±n/a nM
Commentsextracted
Citation Mandal, MTang, HXiao, LSu, JLi, GYang, SPan, WTang, HDeJesus, RHicks, JLombardo, MChu, HHagmann, WPasternak, AGu, XJiang, JDong, SDing, FLondon, CBiswas, DYoung, KHunter, DNZhao, ZYang, D Metallo-beta-lactamase inhibitors US Patent US9708336 Publication Date 7/18/2017
 
Metallo-beta-lactamase type 2
Name:Metallo-beta-lactamase type 2
Type:PROTEIN
Mol. Mass.:28498.15
Organism:Klebsiella pneumoniae
Description:ChEMBL_103887
Residue:270
BDBM262973
NameBDBM262973
Synonyms:9-[3-sulfamoyl-2-(1H-tetrazol-5-yl)- 4-(trifluoromethyl)phenyl]-3- azaspiro[5.5]undecane-3- carboxamidine | US9708336, 826
TypeSmall organic molecule
Emp. Form.C19H25F3N8O2S
Mol. Mass.486.514
SMILESNC(=N)N1CCC2(CCC(CC2)c2ccc(c(c2-c2nnn[nH]2)S(N)(=O)=O)C(F)(F)F)CC1