Reaction Details
TargetMetallo-beta-lactamase type 2
LigandBDBM262979
Substrate/Competitorn/a
Meas. Tech.Class B Enzyme Assay
pH7±n/a
IC50 0.501±n/a nM
Commentsextracted
Citation Mandal, MTang, HXiao, LSu, JLi, GYang, SPan, WTang, HDeJesus, RHicks, JLombardo, MChu, HHagmann, WPasternak, AGu, XJiang, JDong, SDing, FLondon, CBiswas, DYoung, KHunter, DNZhao, ZYang, D Metallo-beta-lactamase inhibitors US Patent US9708336 Publication Date 7/18/2017
 
Metallo-beta-lactamase type 2
Name:Metallo-beta-lactamase type 2
Type:PROTEIN
Mol. Mass.:28498.15
Organism:Klebsiella pneumoniae
Description:ChEMBL_103887
Residue:270
BDBM262979
NameBDBM262979
Synonyms:3-((1r,4r)-4-(piperidin-4-yl)cyclohexyl)-2-(1H-tetrazol-5-yl)-6-(trifluoromethyl)benzenesulfonamide | US9708336, 832
TypeSmall organic molecule
Emp. Form.C19H25F3N6O2S
Mol. Mass.458.501
SMILESNS(=O)(=O)c1c(ccc([C@H]2CCC(CC2)C2CCNCC2)c1-c1nnn[nH]1)C(F)(F)F